BDBM503317 6-Amino-2-(4-amino-4-methyl- piperidin-1-yl)-5-(2,3-dichloro- phenyl)-pyrimidine-4-carboxylic- acid-(2-hydroxy-ethyl)-amide::US11033547, Compound 17::US11696916, Compound 17
SMILES CC1(N)CCN(CC1)c1nc(N)c(-c2cccc(Cl)c2Cl)c(n1)C(=O)NCCO
InChI Key InChIKey=IWMGAWPGQYIEED-UHFFFAOYSA-N
Data  2 IC50
  Tab Delimited (TSV)   2D SDfile   Computed 3D by Vconf -m prep SDfile
Find this compound or compounds like it in BindingDB:
Activity Spreadsheet -- Enzyme Inhibition Constant Data from BindingDB
Found 2 hits for monomerid = 503317
TargetTyrosine-protein phosphatase non-receptor type 11(Homo sapiens (Human))
Merck Patent
US Patent
LigandPNGBDBM503317(6-Amino-2-(4-amino-4-methyl- piperidin-1-yl)-5-(2,...)
Affinity DataIC50:  1.20E+4nM. Assay description: The inhibition of SHP2 by compounds of the invention was monitored using the surrogate substrate DiFMUP after protein activation by a peptide bearing...
Ligand InfoKEGGPC cidPC sid
In DepthDetails US Patent
TargetTyrosine-protein phosphatase non-receptor type 11(Homo sapiens (Human))
Merck Patent
US Patent
LigandPNGBDBM503317(6-Amino-2-(4-amino-4-methyl- piperidin-1-yl)-5-(2,...)
Affinity DataIC50:  1.20E+4nM. Assay description: The inhibition of SHP2 by compounds of the invention was monitored using the surrogate substrate DiFMUP after protein activation by a peptide bearing...
Ligand InfoKEGGPC cidPC sid
In DepthDetails US Patent