BDBM50332142 (S)-2-(3-(hydroxymethyl)phenyl)-4-(piperidin-3-ylamino)thieno[3,2-c]pyridine-7-carboxamide::CHEMBL1288010
SMILES NC(=O)c1cnc(N[C@H]2CCCNC2)c2cc(sc12)-c1cccc(CO)c1
InChI Key InChIKey=YNQHLQYVIDIBNI-AWEZNQCLSA-N
Data  1 IC50
  Tab Delimited (TSV)   2D SDfile   Computed 3D by Vconf -m prep SDfile
Find this compound or compounds like it in BindingDB:
Activity Spreadsheet -- Enzyme Inhibition Constant Data from BindingDB
Found 1 hit for monomerid = 50332142
TargetSerine/threonine-protein kinase Chk1(Homo sapiens (Human))
Merck Research Laboratories
Curated by ChEMBL
LigandPNGBDBM50332142((S)-2-(3-(hydroxymethyl)phenyl)-4-(piperidin-3-yla...)
Affinity DataIC50:  3nM. Assay description: Inhibition of His-tagged CHK1 after 2 hrs by liquid scintillation counting
In DepthDetails ArticlePubMed