BDBM50332288 (R)-4-((4-((6-methoxy-1-oxoisoindolin-2-yl)methyl)-2,5-dioxoimidazolidin-4-yl)ethynyl)benzaldehyde oxime::CHEMBL1287909
SMILES COc1ccc2CN(C[C@]3(NC(=O)NC3=O)C#Cc3ccc(CN=O)cc3)C(=O)c2c1
InChI Key InChIKey=NHJFUEUFHUNKDT-JOCHJYFZSA-N
Data  1 KI
  Tab Delimited (TSV)   2D SDfile   Computed 3D by Vconf -m prep SDfile
Find this compound or compounds like it in BindingDB:
Activity Spreadsheet -- Enzyme Inhibition Constant Data from BindingDB
Found 1 hit for monomerid = 50332288
TargetDisintegrin and metalloproteinase domain-containing protein 17(Homo sapiens (Human))
Merck Research Laboratories
Curated by ChEMBL
LigandPNGBDBM50332288((R)-4-((4-((6-methoxy-1-oxoisoindolin-2-yl)methyl)...)
Affinity DataKi:  0.160nM. Assay description: Inhibition of TACE
In DepthDetails ArticlePubMed