BDBM50332308 CHEMBL1288033::ethyl 3-(5-amino-1-benzoyl-1H-1,2,4-triazol-3-ylamino)benzoate
SMILES CCOC(=O)c1cccc(Nc2nc(N)n(n2)C(=O)c2ccccc2)c1
InChI Key InChIKey=IMMOFEGLUVPBQS-UHFFFAOYSA-N
Data  1 IC50
  Tab Delimited (TSV)   2D SDfile   Computed 3D by Vconf -m prep SDfile
Find this compound or compounds like it in BindingDB:
Activity Spreadsheet -- Enzyme Inhibition Constant Data from BindingDB
Found 1 hit for monomerid = 50332308
TargetNon-receptor tyrosine-protein kinase TYK2(Homo sapiens (Human))
Sri International
Curated by ChEMBL
LigandPNGBDBM50332308(CHEMBL1288033 | ethyl 3-(5-amino-1-benzoyl-1H-1,2,...)
Affinity DataIC50: >1.00E+4nM. Assay description: Inhibition of human recombinant TYK2 by TR-FRET assay
In DepthDetails ArticlePubMed