BDBM50333459 (2S,3S,4S,5S)-2-(hydroxymethyl)-5-octylpyrrolidine-3,4-diol::CHEMBL1641744
SMILES CCCCCCCC[C@@H]1N[C@@H](CO)[C@H](O)[C@H]1O
InChI Key InChIKey=SDYXGHBDCJJNMV-CYDGBPFRSA-N
Data  6 IC50
  Tab Delimited (TSV)   2D SDfile   Computed 3D by Vconf -m prep SDfile
Find this compound or compounds like it in BindingDB:
Activity Spreadsheet -- Enzyme Inhibition Constant Data from BindingDB
Found 6 hits for monomerid = 50333459
TargetLysosomal alpha-glucosidase(Rattus norvegicus)
Tohoku Pharmaceutical University
Curated by ChEMBL
LigandPNGBDBM50333459((2S,3S,4S,5S)-2-(hydroxymethyl)-5-octylpyrrolidine...)
Affinity DataIC50:  320nM. Assay description: Inhibition of Wistar rat small intestine maltase after 30 mins
In DepthDetails ArticlePubMed
TargetSucrase-isomaltase, intestinal(Rattus norvegicus (Rat))
Tohoku Pharmaceutical University
Curated by ChEMBL
LigandPNGBDBM50333459((2S,3S,4S,5S)-2-(hydroxymethyl)-5-octylpyrrolidine...)
Affinity DataIC50:  7.50E+4nM. Assay description: Inhibition of Wistar rat small intestine isomaltase after 30 mins
In DepthDetails ArticlePubMed
TargetLysosomal alpha-glucosidase(Rattus norvegicus)
Tohoku Pharmaceutical University
Curated by ChEMBL
LigandPNGBDBM50333459((2S,3S,4S,5S)-2-(hydroxymethyl)-5-octylpyrrolidine...)
Affinity DataIC50:  320nM. Assay description: Inhibition of rat intestinal maltase using moltose as substrate
In DepthDetails ArticlePubMed
TargetSucrase-isomaltase, intestinal(Rattus norvegicus (Rat))
Tohoku Pharmaceutical University
Curated by ChEMBL
LigandPNGBDBM50333459((2S,3S,4S,5S)-2-(hydroxymethyl)-5-octylpyrrolidine...)
Affinity DataIC50:  450nM. Assay description: Inhibition of rat intestinal sucrase using sucrose as substrate
In DepthDetails ArticlePubMed
TargetSucrase-isomaltase, intestinal(Rattus norvegicus (Rat))
Tohoku Pharmaceutical University
Curated by ChEMBL
LigandPNGBDBM50333459((2S,3S,4S,5S)-2-(hydroxymethyl)-5-octylpyrrolidine...)
Affinity DataIC50:  7.50E+4nM. Assay description: Inhibition of rat intestinal isomaltase using isomoltose as substrate
In DepthDetails ArticlePubMed
TargetSucrase-isomaltase, intestinal(Rattus norvegicus (Rat))
Tohoku Pharmaceutical University
Curated by ChEMBL
LigandPNGBDBM50333459((2S,3S,4S,5S)-2-(hydroxymethyl)-5-octylpyrrolidine...)
Affinity DataIC50:  450nM. Assay description: Inhibition of Wistar rat small intestine sucrase after 30 mins
In DepthDetails ArticlePubMed