BDBM50333510 2-(1,4'-bipiperidin-1'-yl)-5-m-tolyl-1,3,4-thiadiazole::CHEMBL1641827
SMILES Cc1cccc(c1)-c1nnc(s1)N1CCC(CC1)N1CCCCC1
InChI Key InChIKey=IWWVNZMWWFNPCJ-UHFFFAOYSA-N
Data  1 KI
  Tab Delimited (TSV)   2D SDfile   Computed 3D by Vconf -m prep SDfile
Find this compound or compounds like it in BindingDB:
Activity Spreadsheet -- Enzyme Inhibition Constant Data from BindingDB
Found 1 hit for monomerid = 50333510
TargetHistamine H3 receptor(Homo sapiens (Human))
Merck Research Laboratories
Curated by ChEMBL
LigandPNGBDBM50333510(2-(1,4'-bipiperidin-1'-yl)-5-m-tolyl-1,3,4-thiadia...)
Affinity DataKi:  60nM. Assay description: Displacement of [3H]-N-alpha-methylhistamine from human recombinant histamine H3 receptor expressed in HEK cells after 30 mins by scintillation count...
In DepthDetails ArticlePubMed