BDBM50333529 2-(4-methoxyphenyl)-5-(4-(pyrrolidin-1-yl)piperidin-1-yl)-1,3,4-thiadiazole::CHEMBL1641846
SMILES COc1ccc(cc1)-c1nnc(s1)N1CCC(CC1)N1CCCC1
InChI Key InChIKey=VVZVXHJCSMIAOW-UHFFFAOYSA-N
Data  1 KI
  Tab Delimited (TSV)   2D SDfile   Computed 3D by Vconf -m prep SDfile
Find this compound or compounds like it in BindingDB:
Activity Spreadsheet -- Enzyme Inhibition Constant Data from BindingDB
Found 1 hit for monomerid = 50333529
TargetHistamine H3 receptor(Homo sapiens (Human))
Merck Research Laboratories
Curated by ChEMBL
LigandPNGBDBM50333529(2-(4-methoxyphenyl)-5-(4-(pyrrolidin-1-yl)piperidi...)
Affinity DataKi:  601nM. Assay description: Displacement of [3H]-N-alpha-methylhistamine from human recombinant histamine H3 receptor expressed in HEK cells after 30 mins by scintillation count...
In DepthDetails ArticlePubMed