BDBM50334756 3-(4-Chlorophenylsulfonyl)-N-(piperidin-4-yl)-1H-indazol-5-amine HCl::CHEMBL1642885
SMILES Clc1ccc(cc1)S(=O)(=O)c1n[nH]c2ccc(NC3CCNCC3)cc12
InChI Key InChIKey=LGCCZQBYTUBZJO-UHFFFAOYSA-N
Data  1 KI  1 IC50
  Tab Delimited (TSV)   2D SDfile   Computed 3D by Vconf -m prep SDfile
Find this compound or compounds like it in BindingDB:
Activity Spreadsheet -- Enzyme Inhibition Constant Data from BindingDB
Found 2 hits for monomerid = 50334756
Target5-hydroxytryptamine receptor 6(Homo sapiens (Human))
Wyeth Research
Curated by ChEMBL
LigandPNGBDBM50334756(3-(4-Chlorophenylsulfonyl)-N-(piperidin-4-yl)-1H-i...)
Affinity DataKi:  2.30nM. Assay description: Displacement of [3H]-LSD from cloned human 5-HT6 receptor expressed in human HeLa cells
In DepthDetails ArticlePubMed
Target5-hydroxytryptamine receptor 6(Homo sapiens (Human))
Wyeth Research
Curated by ChEMBL
LigandPNGBDBM50334756(3-(4-Chlorophenylsulfonyl)-N-(piperidin-4-yl)-1H-i...)
Affinity DataIC50:  44nM. Assay description: Antagonist activity at cloned human 5-HT6 receptor expressed in human HeLa cells assessed as inhibition of 5HT-induced cyclic AMP formation
In DepthDetails ArticlePubMed