BDBM503359 2-(4-Amino-4-methyl-piperidin-1- yl)-5-(1H-benzoimidazol-4-yl)- pyrimidine-4-carboxylic acid amide::US11033547, Compound 60::US11696916, Compound 60
SMILES CC1(N)CCN(CC1)c1ncc(-c2cccc3[nH]cnc23)c(n1)C(N)=O
InChI Key InChIKey=ZXWYKJJLZBOTIB-UHFFFAOYSA-N
Data  2 IC50
  Tab Delimited (TSV)   2D SDfile   Computed 3D by Vconf -m prep SDfile
Find this compound or compounds like it in BindingDB:
Activity Spreadsheet -- Enzyme Inhibition Constant Data from BindingDB
Found 2 hits for monomerid = 503359
TargetTyrosine-protein phosphatase non-receptor type 11(Homo sapiens (Human))
Merck Patent
US Patent
LigandPNGBDBM503359(2-(4-Amino-4-methyl-piperidin-1- yl)-5-(1H-benzoim...)
Affinity DataIC50: >1.00E+4nM. Assay description: The inhibition of SHP2 by compounds of the invention was monitored using the surrogate substrate DiFMUP after protein activation by a peptide bearing...
Ligand InfoPC cidPC sid
In DepthDetails US Patent
TargetTyrosine-protein phosphatase non-receptor type 11(Homo sapiens (Human))
Merck Patent
US Patent
LigandPNGBDBM503359(2-(4-Amino-4-methyl-piperidin-1- yl)-5-(1H-benzoim...)
Affinity DataIC50: >1.00E+4nM. Assay description: The inhibition of SHP2 by compounds of the invention was monitored using the surrogate substrate DiFMUP after protein activation by a peptide bearing...
Ligand InfoPC cidPC sid
In DepthDetails US Patent