BDBM50336550 5-(6-Aminopurin-9-yl)-4-chlorocyclopent-3-ene-1,2-diol::CHEMBL1672011
SMILES Nc1ncnc2n(cnc12)[C@H]1[C@H](O)[C@H](O)C=C1Cl
InChI Key InChIKey=USJLMVLXKZMTIF-LPBLVHEISA-N
Data  1 IC50
  Tab Delimited (TSV)   2D SDfile   Computed 3D by Vconf -m prep SDfile
Find this compound or compounds like it in BindingDB:
Activity Spreadsheet -- Enzyme Inhibition Constant Data from BindingDB
Found 1 hit for monomerid = 50336550
TargetAdenosylhomocysteinase(Homo sapiens (Human))
Ewha Womans University
Curated by ChEMBL
LigandPNGBDBM50336550(5-(6-Aminopurin-9-yl)-4-chlorocyclopent-3-ene-1,2-...)
Affinity DataIC50: >1.00E+6nM. Assay description: Inhibition of human placental AdoHcy hydrolase expressed in Escherichia coli JM109
In DepthDetails ArticlePubMed