BDBM50338168 (S)-2-benzamido-3-(4-(dimethylcarbamoyloxy)phenyl)propanoic acid::CHEMBL1684955
SMILES CN(C)C(=O)Oc1ccc(C[C@H](NC(=O)c2ccccc2)C(O)=O)cc1
InChI Key InChIKey=WKYAPDHPAALDDA-INIZCTEOSA-N
Data  1 IC50
  Tab Delimited (TSV)   2D SDfile   Computed 3D by Vconf -m prep SDfile
Find this compound or compounds like it in BindingDB:
Activity Spreadsheet -- Enzyme Inhibition Constant Data from BindingDB
Found 1 hit for monomerid = 50338168
TargetIntegrin alpha-4/beta-1(Homo sapiens (Human))
Elan Pharmaceuticals
Curated by ChEMBL
LigandPNGBDBM50338168((S)-2-benzamido-3-(4-(dimethylcarbamoyloxy)phenyl)...)
Affinity DataIC50:  130nM. Assay description: Inhibition of integrin alpha4beta1-mediated Jurkat cell adhesion to VCAM-1 by FACS analysis
In DepthDetails ArticlePubMed