BDBM50338953 4-Dodecyl-N-(5-ethyl-1,3,4-thiadiazol-2-yl)benzenesulfonamide::CHEMBL1685053::US9320734, 112
SMILES CCCCCCCCCCCCc1ccc(cc1)S(=O)(=O)Nc1nnc(CC)s1
InChI Key InChIKey=NQJAMQWCJPPKIO-UHFFFAOYSA-N
Data  1 KI  3 Kd
  Tab Delimited (TSV)   2D SDfile   Computed 3D by Vconf -m prep SDfile
Find this compound or compounds like it in BindingDB:
Activity Spreadsheet -- Enzyme Inhibition Constant Data from BindingDB
Found 4 hits for monomerid = 50338953
TargetRAC-alpha serine/threonine-protein kinase(Mus musculus)
The University Of Arizona
Curated by ChEMBL
LigandPNGBDBM50338953(4-Dodecyl-N-(5-ethyl-1,3,4-thiadiazol-2-yl)benzene...)
Affinity DataKi:  7.00E+3nM. Assay description: Displacement of biotinylated phosphatidylinositol-3,4,5-phosphate from mouse AKT1 PH domain by surface plasmon resonance competitive binding assay
In DepthDetails ArticlePubMed
TargetRAC-alpha serine/threonine-protein kinase [1-123](Homo sapiens (Human))
The University Of Texas System
US Patent
LigandPNGBDBM50338953(4-Dodecyl-N-(5-ethyl-1,3,4-thiadiazol-2-yl)benzene...)
Affinity DataKd:  7.90E+3nM. Assay description: SPR interaction analyses were performed with a Biacore 2000, using Biacore 2000 Control Software v3.2 and BIAevaluation v4.1 analysis software (Biaco...
In DepthDetails US Patent
TargetRAC-alpha serine/threonine-protein kinase [1-123](Homo sapiens (Human))
The University Of Texas System
US Patent
LigandPNGBDBM50338953(4-Dodecyl-N-(5-ethyl-1,3,4-thiadiazol-2-yl)benzene...)
Affinity DataKd:  7.59E+3nM. Assay description: SPR interaction analyses were performed with a Biacore 2000, using Biacore 2000 Control Software v3.2 and BIAevaluation v4.1 analysis software (Biaco...
In DepthDetails US Patent
TargetRAC-alpha serine/threonine-protein kinase [1-123](Homo sapiens (Human))
The University Of Texas System
US Patent
LigandPNGBDBM50338953(4-Dodecyl-N-(5-ethyl-1,3,4-thiadiazol-2-yl)benzene...)
Affinity DataKd:  7.30E+4nM. Assay description: SPR interaction analyses were performed with a Biacore 2000, using Biacore 2000 Control Software v3.2 and BIAevaluation v4.1 analysis software (Biaco...
In DepthDetails US Patent