BDBM50341227 1-(4-fluoro-2-(trifluoromethyl)phenyl)-9-(quinolin-3-yl)benzo[h][1,6]naphthyridin-2(1H)-one::CHEMBL1765712
SMILES Fc1ccc(c(c1)C(F)(F)F)-n1c2c(ccc1=O)cnc1ccc(cc21)-c1cnc2ccccc2c1
InChI Key InChIKey=NMJPFRJCPALLRK-UHFFFAOYSA-N
Data  2 EC50
  Tab Delimited (TSV)   2D SDfile   Computed 3D by Vconf -m prep SDfile
Find this compound or compounds like it in BindingDB:
Activity Spreadsheet -- Enzyme Inhibition Constant Data from BindingDB
Found 2 hits for monomerid = 50341227
TargetPhosphatidylinositol 4,5-bisphosphate 3-kinase catalytic subunit alpha isoform(Homo sapiens (Human))
Dana-Farber Cancer Institute
Curated by ChEMBL
LigandPNGBDBM50341227(1-(4-fluoro-2-(trifluoromethyl)phenyl)-9-(quinolin...)
Affinity DataEC50: >1.25E+3nM. Assay description: Inhibition of PI3Kalpha in human PC3 cells expressing Akt1 S473D mutant assessed as phosphorylation of Akt Thr308 by immunoblotting
In DepthDetails ArticlePubMed
TargetSerine/threonine-protein kinase mTOR(Mus musculus (Mouse))
Dana-Farber Cancer Institute
Curated by ChEMBL
LigandPNGBDBM50341227(1-(4-fluoro-2-(trifluoromethyl)phenyl)-9-(quinolin...)
Affinity DataEC50:  25nM. Assay description: Inhibition of mTOR in p53-deficient MEF assessed as phosphorylation of S6K1 at Thr389 by immunoblotting
In DepthDetails ArticlePubMed