BDBM50341369 CHEMBL1766506::[6-(2,4-Difluorophenoxy)-7-oxo-2-(tetrahydro-pyran-4-ylamino)-7H-pyrido[2,3-d]pyrimidin-8-yl]-acetonitrile
SMILES Fc1ccc(Oc2cc3cnc(NC4CCOCC4)nc3n(CC#N)c2=O)c(F)c1
InChI Key InChIKey=VMRGPSZYAXRWQY-UHFFFAOYSA-N
Data  1 IC50
  Tab Delimited (TSV)   2D SDfile   Computed 3D by Vconf -m prep SDfile
Find this compound or compounds like it in BindingDB:
Activity Spreadsheet -- Enzyme Inhibition Constant Data from BindingDB
Found 1 hit for monomerid = 50341369
TargetMitogen-activated protein kinase 14(Homo sapiens (Human))
Roche Palo Alto
Curated by ChEMBL
LigandPNGBDBM50341369(CHEMBL1766506 | [6-(2,4-Difluorophenoxy)-7-oxo-2-(...)
Affinity DataIC50:  2nM. Assay description: Inhibition of human recombinant p38alpha assessed as incorporation of 33P from gamma-[33P]ATP into myelin basic protein after 30 mins by scintillatio...
In DepthDetails ArticlePubMed