BDBM50341992 4-(3-(dibenzylamino)phenyl)-2,4-dioxobutanoic acid::4-[3-(dibenzylamino)phenyl]-2,4-dioxobutanoic acid::CHEMBL1234135
SMILES OC(=O)C(=O)CC(=O)c1cccc(c1)N(Cc1ccccc1)Cc1ccccc1
InChI Key InChIKey=RMWVENXKUQXLPW-UHFFFAOYSA-N
Data  1 IC50
PDB links: 1 PDB ID matches this monomer.
  Tab Delimited (TSV)   2D SDfile   Computed 3D by Vconf -m prep SDfile
Find this compound or compounds like it in BindingDB:
Activity Spreadsheet -- Enzyme Inhibition Constant Data from BindingDB
Found 1 hit for monomerid = 50341992
TargetTyrosine-protein phosphatase non-receptor type 1(Homo sapiens (Human))
Max Planck Institute Of Molecular Physiology
Curated by ChEMBL
LigandPNGBDBM50341992(4-(3-(dibenzylamino)phenyl)-2,4-dioxobutanoic acid...)
Affinity DataIC50:  2.00E+4nM. Assay description: Inhibition of PTP1B