BDBM50342991 2-(2-amino-6-(4-methylpiperazin-1-yl)pyrimidin-4-ylamino)ethanol::CHEMBL1770976
SMILES CN1CCN(CC1)c1cc(NCCO)nc(N)n1
InChI Key InChIKey=RMXGLKUAUKQRHF-UHFFFAOYSA-N
Data  1 KI
  Tab Delimited (TSV)   2D SDfile   Computed 3D by Vconf -m prep SDfile
Find this compound or compounds like it in BindingDB:
Activity Spreadsheet -- Enzyme Inhibition Constant Data from BindingDB
Found 1 hit for monomerid = 50342991
TargetHistamine H4 receptor(Homo sapiens (Human))
Johnson & Johnson Pharmaceutical Research & Development
Curated by ChEMBL
LigandPNGBDBM50342991(2-(2-amino-6-(4-methylpiperazin-1-yl)pyrimidin-4-y...)
Affinity DataKi:  25nM. Assay description: Displacement of [3H]histamine from human histamine H4 receptor
In DepthDetails ArticlePubMed