BDBM50343603 CHEMBL1774518::N-[2-(7-Benzyl-1,6-dihydro-2H-indeno[5,4-b]furan-8-yl)-ethyl]acetamide
SMILES CC(=O)NCCC1=C(Cc2ccccc2)Cc2ccc3OCCc3c12
InChI Key InChIKey=VDWZKXTUDKKGJA-UHFFFAOYSA-N
Data  2 KI
  Tab Delimited (TSV)   2D SDfile   Computed 3D by Vconf -m prep SDfile
Find this compound or compounds like it in BindingDB:
Activity Spreadsheet -- Enzyme Inhibition Constant Data from BindingDB
Found 2 hits for monomerid = 50343603
TargetMelatonin receptor type 1B(Homo sapiens (Human))
Takeda Pharmaceutical
Curated by ChEMBL
LigandPNGBDBM50343603(CHEMBL1774518 | N-[2-(7-Benzyl-1,6-dihydro-2H-inde...)
Affinity DataKi:  0.00850nM. Assay description: Displacement of [125I]-2-iodomelatonin from human MT2 receptor expressed on CHO cells microscintillation counting
In DepthDetails ArticlePubMed
TargetMelatonin receptor type 1A(Homo sapiens (Human))
Takeda Pharmaceutical
Curated by ChEMBL
LigandPNGBDBM50343603(CHEMBL1774518 | N-[2-(7-Benzyl-1,6-dihydro-2H-inde...)
Affinity DataKi:  2.70nM. Assay description: Displacement of [125I]-2-iodomelatonin from human MT1 receptor expressed on CHO cells by microscintillation counting
In DepthDetails ArticlePubMed