BDBM503439 4-Chloro-5-(4-(difluoromethoxy)-6-(3,3,3-trifluoro-2,2-dimethylpropyl)pyridin-3-yl)-1-ethyl-N-(((1r,4r)-4-sulfamoylcyclohexyl)methyl)-1H-pyrazole-3-carboxamide::US11034658, Example 11
SMILES CCn1nc(C(=O)NC[C@H]2CC[C@@H](CC2)NS(=O)=O)c(Cl)c1-c1cnc(CC(C)(C)C(F)(F)F)cc1OC(F)F
InChI Key InChIKey=BYHGLZRUYCUDOL-HDJSIYSDSA-N
Data  1 Kd
  Tab Delimited (TSV)   2D SDfile   Computed 3D by Vconf -m prep SDfile
Find this compound or compounds like it in BindingDB:
Activity Spreadsheet -- Enzyme Inhibition Constant Data from BindingDB
Found 1 hit for monomerid = 503439
TargetNuclear receptor ROR-gamma(Homo sapiens (Human))
Janssen Pharmaceutica
US Patent
LigandPNGBDBM503439(4-Chloro-5-(4-(difluoromethoxy)-6-(3,3,3-trifluoro...)
Affinity DataKd:  1.40nM. Assay description: ThermoFluorŪ is a fluorescence based assay that estimates ligand binding affinities by measuring the effect of a ligand on protein thermal stability ...
Ligand InfoPC cidPC sid
In DepthDetails US Patent