BDBM50343937 CHEMBL1780257::N-(4-(3-cyano-4-methyl-6-(5-methyl-1H-pyrazol-3-ylamino)pyridin-2-ylthio)phenyl)acetamide
SMILES CC(=O)Nc1ccc(Sc2nc(Nc3cc(C)n[nH]3)cc(C)c2C#N)cc1
InChI Key InChIKey=HGMSKESQUCLBIT-UHFFFAOYSA-N
Data  1 KI
  Tab Delimited (TSV)   2D SDfile   Computed 3D by Vconf -m prep SDfile
Find this compound or compounds like it in BindingDB:
Activity Spreadsheet -- Enzyme Inhibition Constant Data from BindingDB
Found 1 hit for monomerid = 50343937
TargetAurora kinase A(Homo sapiens (Human))
Mitsubishi Tanabe Pharma
Curated by ChEMBL
LigandPNGBDBM50343937(CHEMBL1780257 | N-(4-(3-cyano-4-methyl-6-(5-methyl...)
Affinity DataKi:  5.30nM. Assay description: Inhibition of aurora A
In DepthDetails ArticlePubMed