BDBM50347159 CHEMBL1797511
SMILES CS(=O)(=O)c1ccc(cc1)C1=C(C(=O)OC1)c1ccc(CO)cc1
InChI Key InChIKey=IPUXISVPZLIZNP-UHFFFAOYSA-N
Data  2 IC50
  Tab Delimited (TSV)   2D SDfile   Computed 3D by Vconf -m prep SDfile
Find this compound or compounds like it in BindingDB:
Activity Spreadsheet -- Enzyme Inhibition Constant Data from BindingDB
Found 2 hits for monomerid = 50347159
TargetProstaglandin G/H synthase 1(Ovis aries (Sheep))
University Of Alberta
Curated by ChEMBL
LigandPNGBDBM50347159(CHEMBL1797511)
Affinity DataIC50:  3.31E+4nM. Assay description: Inhibition of ovine COX1 by enzyme immuno assay
In DepthDetails ArticlePubMed
TargetProstaglandin G/H synthase 2(Homo sapiens (Human))
University Of Alberta
Curated by ChEMBL
LigandPNGBDBM50347159(CHEMBL1797511)
Affinity DataIC50:  4.20E+3nM. Assay description: Inhibition of human recombinant COX2 by enzyme immuno assay
In DepthDetails ArticlePubMed