BDBM50347350 CHEMBL1801355
SMILES C[C@@H](NC(=O)C1(CC1)NC(=O)C(F)(F)F)c1ccc(cc1F)-n1nc(Cl)c2ccccc12
InChI Key InChIKey=NKPCWYCHYGPAOO-LLVKDONJSA-N
Data  1 KI
  Tab Delimited (TSV)   2D SDfile   Computed 3D by Vconf -m prep SDfile
Find this compound or compounds like it in BindingDB:
Activity Spreadsheet -- Enzyme Inhibition Constant Data from BindingDB
Found 1 hit for monomerid = 50347350
TargetCannabinoid receptor 1(Homo sapiens (Human))
Merck Research Laboratories
Curated by ChEMBL
LigandPNGBDBM50347350(CHEMBL1801355)
Affinity DataKi:  11nM. Assay description: Displacement of radioligand from human CB1 receptor expressed in CHO cells
In DepthDetails ArticlePubMed