BDBM50347376 CHEMBL1801346
SMILES C[C@@H](NC(=O)C1(CC1)NC(=O)c1cncc(O)c1)c1ccc(cc1F)-n1nc(Cl)c2ccccc12
InChI Key InChIKey=HLJHFKBGERUYAG-CQSZACIVSA-N
Data  1 KI
  Tab Delimited (TSV)   2D SDfile   Computed 3D by Vconf -m prep SDfile
Find this compound or compounds like it in BindingDB:
Activity Spreadsheet -- Enzyme Inhibition Constant Data from BindingDB
Found 1 hit for monomerid = 50347376
TargetCannabinoid receptor 1(Homo sapiens (Human))
Merck Research Laboratories
Curated by ChEMBL
LigandPNGBDBM50347376(CHEMBL1801346)
Affinity DataKi:  0.300nM. Assay description: Displacement of radioligand from human CB1 receptor expressed in CHO cells
In DepthDetails ArticlePubMed