BDBM50347456 CHEMBL1802192
SMILES OC[C@H]1O[C@H](Oc2cc(Cl)c(c(Cl)c2)-c2ccc(cc2)C([O-])=O)[C@@H](O)[C@@H](O)[C@@H]1O
InChI Key InChIKey=CZKKTBRGIPKRJB-REPCXEQLSA-M
Data  1 IC50
  Tab Delimited (TSV)   2D SDfile   Computed 3D by Vconf -m prep SDfile
Find this compound or compounds like it in BindingDB:
Activity Spreadsheet -- Enzyme Inhibition Constant Data from BindingDB
Found 1 hit for monomerid = 50347456
TargetType 1 fimbrin D-mannose specific adhesin(Escherichia coli (strain K12))
University Of Basel
Curated by ChEMBL
LigandPNGBDBM50347456(CHEMBL1802192)
Affinity DataIC50:  23.9nM. Assay description: Competitive inhibition of His-tagged FimH carbohydrate recognizing domain expressed in Escherichia coli HM125 using ABTS-substrate after 3 hrs by cal...
In DepthDetails ArticlePubMed