BDBM503479 5-(2-(Difluoromethoxy)-6-(3,3,3-trifluoro-2,2-dimethylpropyl)pyridin-3-yl)-N-(((1S*,2S*,4S*)-1,2-dihydroxy-4-(methylsulfonyl)cyclohexyl)methyl)-1-ethyl-4-methyl-1H-pyrazole-3-carboxamide::US11034658, Example 51
SMILES CCn1nc(C(=O)NC[C@@]2(O)CC[C@H](C)C[C@@H]2O)c(C)c1-c1ccc(CC(C)(C)C(F)(F)F)nc1OC(F)F
InChI Key InChIKey=XXOOGDLQENNXGT-KIKZRXFUSA-N
Data  1 Kd
  Tab Delimited (TSV)   2D SDfile   Computed 3D by Vconf -m prep SDfile
Find this compound or compounds like it in BindingDB:
Activity Spreadsheet -- Enzyme Inhibition Constant Data from BindingDB
Found 1 hit for monomerid = 503479
TargetNuclear receptor ROR-gamma(Homo sapiens (Human))
Janssen Pharmaceutica
US Patent
LigandPNGBDBM503479(5-(2-(Difluoromethoxy)-6-(3,3,3-trifluoro-2,2-dime...)
Affinity DataKd:  3.20nM. Assay description: ThermoFluorŪ is a fluorescence based assay that estimates ligand binding affinities by measuring the effect of a ligand on protein thermal stability ...
Ligand InfoPC cidPC sid
In DepthDetails US Patent