BDBM50349337 CHEMBL1809242
SMILES Cc1ccc(C)c(c1)N1CCN(CC1)C(=O)C[C@@H](NS(=O)(=O)Cc1ccccc1)C(=O)N1CCC[C@H]1C(=O)NCc1ccc(cc1)C(N)=N
InChI Key InChIKey=WUUKQSZMHJKYPC-JSOSNVBQSA-N
Data  1 KI
  Tab Delimited (TSV)   2D SDfile   Computed 3D by Vconf -m prep SDfile
Find this compound or compounds like it in BindingDB:
Activity Spreadsheet -- Enzyme Inhibition Constant Data from BindingDB
Found 1 hit for monomerid = 50349337
TargetTransmembrane protease serine 11D(Homo sapiens (Human))
Philipps University Marburg
Curated by ChEMBL
LigandPNGBDBM50349337(CHEMBL1809242)
Affinity DataKi:  73nM. Assay description: Inhibition of human recombinant airway trypsin-like protease HAT using D-cyclohexylalanine-Pro-Arg-AMC as substrate by fluorescence plate reader anal...
In DepthDetails ArticlePubMed