BDBM50349746 CHEMBL1809173::US8822447, 116::US9771375, Example 116
SMILES CSc1nn(-c2ccc(N)cc2)c2cc(ccc12)C1=CCNCC1
InChI Key InChIKey=FWXOAZAZUWTCQQ-UHFFFAOYSA-N
Data  3 IC50
  Tab Delimited (TSV)   2D SDfile   Computed 3D by Vconf -m prep SDfile
Find this compound or compounds like it in BindingDB:
Activity Spreadsheet -- Enzyme Inhibition Constant Data from BindingDB
Found 3 hits for monomerid = 50349746
TargetKetohexokinase(Homo sapiens (Human))
Janssen Pharmaceutica
US Patent
LigandPNGBDBM50349746(CHEMBL1809173 | US8822447, 116 | US9771375, Exampl...)
Affinity DataIC50:  160nMT: 2°C. Assay description: An enzymatic assay was developed to measure KHK-mediated conversion of D-fructose to Fructose-1-P (F-1-P) using High Throughput Mass Spectroscopy (HT...
In DepthDetails US Patent
TargetKetohexokinase(Homo sapiens (Human))
Janssen Pharmaceutica
US Patent
LigandPNGBDBM50349746(CHEMBL1809173 | US8822447, 116 | US9771375, Exampl...)
Affinity DataIC50:  160nM. Assay description: An enzymatic assay was developed to measure KHK-mediated conversion of D-fructose to Fructose-1-P (F-1-P) using High Throughput Mass Spectroscopy (HT...
In DepthDetails US Patent
TargetKetohexokinase(Homo sapiens (Human))
Janssen Pharmaceutica
US Patent
LigandPNGBDBM50349746(CHEMBL1809173 | US8822447, 116 | US9771375, Exampl...)
Affinity DataIC50:  160nM. Assay description: Inhibition of KHK-mediated conversion of D-fructose to fructose-1-phosphate after 60 mins by high throughput mass spectrometry analysis
In DepthDetails ArticlePubMed