BDBM50350132 CHEMBL1814086
SMILES Cc1cccc2C(=O)N(C(=O)c12)c1ccc(cc1)C(N)=N
InChI Key InChIKey=KDWKLFURLBISCV-UHFFFAOYSA-N
Data  1 KI
PDB links: 1 PDB ID matches this monomer.
  Tab Delimited (TSV)   2D SDfile   Computed 3D by Vconf -m prep SDfile
Find this compound or compounds like it in BindingDB:
Activity Spreadsheet -- Enzyme Inhibition Constant Data from BindingDB
Found 1 hit for monomerid = 50350132
TargetThymidylate synthase(Lactobacillus casei)
Universita Degli Studi Di Modena E Reggio Emilia
Curated by ChEMBL
LigandPNGBDBM50350132(CHEMBL1814086)
Affinity DataKi:  9.00E+3nM. Assay description: Inhibition of Lactobacillus casei thymidylate synthase using N5,N10-methylene tetrahydrofolate by chromogenic assay