BDBM50351187 CHEMBL1818114
SMILES COc1ccc(cc1OC)-c1cc2nc(N)nc(N)c2cc1C
InChI Key InChIKey=UGJMRAQTQALEME-UHFFFAOYSA-N
Data  2 KI
PDB links: 1 PDB ID matches this monomer.
  Tab Delimited (TSV)   2D SDfile   Computed 3D by Vconf -m prep SDfile
Find this compound or compounds like it in BindingDB:
Activity Spreadsheet -- Enzyme Inhibition Constant Data from BindingDB
Found 2 hits for monomerid = 50351187
TargetDihydrofolate reductase(Staphylococcus aureus)
Trius Therapeutics, San Diego, Ca 92121, United States.
Curated by ChEMBL
LigandPNGBDBM50351187(CHEMBL1818114)
Affinity DataKi:  0.350nM. Assay description: Inhibition of Staphylococcus aureus DHFR assessed as oxidation of NADPH using dihydrofolate as substrate pre-incubated for 10 mins before substrate a...
TargetDihydrofolate reductase(Homo sapiens (Human))
Trius Therapeutics, San Diego, Ca 92121, United States.
Curated by ChEMBL
LigandPNGBDBM50351187(CHEMBL1818114)
Affinity DataKi:  12.2nM. Assay description: Inhibition of human DHFR assessed as oxidation of NADPH using dihydrofolate as substrate pre-incubated for 10 mins before substrate addition by spect...
In DepthDetails ArticlePubMed