BDBM50351204 CHEMBL1818381
SMILES OC(=O)c1cn(C2CC2)c2cc(c(F)cc2c1[O-])=[N+]1CCN(CC1)C(=O)CC[N+]([O-])=O
InChI Key InChIKey=XJPQKLJJDPCGAQ-UHFFFAOYSA-N
Data  1 IC50
  Tab Delimited (TSV)   2D SDfile   Computed 3D by Vconf -m prep SDfile
Find this compound or compounds like it in BindingDB:
Activity Spreadsheet -- Enzyme Inhibition Constant Data from BindingDB
Found 1 hit for monomerid = 50351204
TargetIsocitrate lyase(Mycobacterium tuberculosis)
Institute Of Technology And Science-Pilani
Curated by ChEMBL
LigandPNGBDBM50351204(CHEMBL1818381)
Affinity DataIC50:  120nM. Assay description: Inhibition of Mycobacterium tuberculosis isocitrate lyase
In DepthDetails ArticlePubMed