BDBM50351207 CHEMBL1818287
SMILES [O-][N+](=O)CCC(=O)Nc1ccc(Br)cc1
InChI Key InChIKey=OBIKPBWOWGAFSY-UHFFFAOYSA-N
Data  1 IC50
  Tab Delimited (TSV)   2D SDfile   Computed 3D by Vconf -m prep SDfile
Find this compound or compounds like it in BindingDB:
Activity Spreadsheet -- Enzyme Inhibition Constant Data from BindingDB
Found 1 hit for monomerid = 50351207
TargetIsocitrate lyase(Mycobacterium tuberculosis)
Institute Of Technology And Science-Pilani
Curated by ChEMBL
LigandPNGBDBM50351207(CHEMBL1818287)
Affinity DataIC50:  3.25E+4nM. Assay description: Inhibition of Mycobacterium tuberculosis isocitrate lyase
In DepthDetails ArticlePubMed