BDBM50351208 CHEMBL1818421
SMILES CC(=O)C1CCC(CC1)NC(=O)Nc1ccc(OC(F)(F)F)cc1
InChI Key InChIKey=QLTWMGWHLVAPAS-UHFFFAOYSA-N
Data  2 IC50
  Tab Delimited (TSV)   2D SDfile   Computed 3D by Vconf -m prep SDfile
Find this compound or compounds like it in BindingDB:
Activity Spreadsheet -- Enzyme Inhibition Constant Data from BindingDB
Found 2 hits for monomerid = 50351208
TargetBifunctional epoxide hydrolase 2(Homo sapiens (Human))
St. Jude Children'S Research Hospital
Curated by ChEMBL
LigandPNGBDBM50351208(CHEMBL1818421)
Affinity DataIC50:  12nM. Assay description: Inhibition of human recombinant soluble epoxide hydrolase using CMNPC as substrate after 10 mins by fluorescent assay
In DepthDetails ArticlePubMed
TargetEpoxide hydrolase B(Mycobacterium tuberculosis)
St. Jude Children'S Research Hospital
Curated by ChEMBL
LigandPNGBDBM50351208(CHEMBL1818421)
Affinity DataIC50:  3.16E+4nM. Assay description: Inhibition of Mycobacterium tuberculosis recombinant EphB expressed in Escherichia coli BL21 using CMNPC as substrate after 30 mins by fluorescent as...
In DepthDetails ArticlePubMed