BDBM503523 N-[(7S)-4-fluorobicyclo[4.2.0]octa- 1,3,5-trien-7-yl]-N'-hydroxy-4-{[1- (1H-1,2,4-triazole-3- carbonyl)azetidin-3-yl]oxy}-1,2,5- oxadiazole-3-carboximidamide::US11034661, Example 30
SMILES O\N=C(/N[C@H]1Cc2ccc(F)cc12)c1nonc1OC1CN(C1)C(=O)c1nc[nH]n1
InChI Key
Data  1 IC50
  Tab Delimited (TSV)   2D SDfile   Computed 3D by Vconf -m prep SDfile
Find this compound or compounds like it in BindingDB:
Activity Spreadsheet -- Enzyme Inhibition Constant Data from BindingDB
Found 1 hit for monomerid = 503523
TargetIndoleamine 2,3-dioxygenase 1(Homo sapiens (Human))
Merck Sharp & Dohme
US Patent
LigandPNGBDBM503523(N-[(7S)-4-fluorobicyclo[4.2.0]octa- 1,3,5-trien-7...)
Affinity DataIC50:  56nM. Assay description: HIS-tagged IDO1 protein was recombinantly expressed in Escherichia coli using ZYP5052 autoinduction media supplemented with 500 μM delta aminole...
Ligand InfoPC cidPC sid
In DepthDetails US Patent