BDBM50353043 CHEMBL1822522
SMILES COc1cc(ccc1Nc1ncc2ccc(-c3ccccc3OC)n2n1)N1CCN(CC1)N1CCOCC1
InChI Key InChIKey=ZCIQMENOTTVELZ-UHFFFAOYSA-N
Data  3 IC50
  Tab Delimited (TSV)   2D SDfile   Computed 3D by Vconf -m prep SDfile
Find this compound or compounds like it in BindingDB:
Activity Spreadsheet -- Enzyme Inhibition Constant Data from BindingDB
Found 3 hits for monomerid = 50353043
TargetALK tyrosine kinase receptor/Nucleophosmin(Homo sapiens (Human))
Cephalon
Curated by ChEMBL
LigandPNGBDBM50353043(CHEMBL1822522)
Affinity DataIC50:  85nM. Assay description: Inhibition of NPM/ALK phosphorylation in human KARPAS299 cells by ELISA
In DepthDetails ArticlePubMed
TargetALK tyrosine kinase receptor(Homo sapiens (Human))
Cephalon
Curated by ChEMBL
LigandPNGBDBM50353043(CHEMBL1822522)
Affinity DataIC50:  9nM. Assay description: Inhibition of human recombinant ALK assessed as phosphorylated product using PLC-gamma/GST substrate by modified ELISA method
In DepthDetails ArticlePubMed
TargetInsulin receptor(Homo sapiens (Human))
Cephalon
Curated by ChEMBL
LigandPNGBDBM50353043(CHEMBL1822522)
Affinity DataIC50:  357nM. Assay description: Inhibition of IR
In DepthDetails ArticlePubMed