BDBM50353736 CHEMBL1830820
SMILES OC(=O)c1cc2cc(O)ccc2oc1=O
InChI Key InChIKey=SLPOZBYDRWPSBE-UHFFFAOYSA-N
Data  1 IC50
  Tab Delimited (TSV)   2D SDfile   Computed 3D by Vconf -m prep SDfile
Find this compound or compounds like it in BindingDB:
Activity Spreadsheet -- Enzyme Inhibition Constant Data from BindingDB
Found 1 hit for monomerid = 50353736
TargetAmine oxidase [flavin-containing] A(Homo sapiens (Human))
Sapienza University Of Rome
Curated by ChEMBL
LigandPNGBDBM50353736(CHEMBL1830820)
Affinity DataIC50:  4.02E+4nM. Assay description: Inhibition of human recombinant MAO-A expressed in baculovirus infected BTI-TN-5B1-4 cells assessed as production of hydrogen peroxide from p-tyramin...
In DepthDetails ArticlePubMed