BDBM50353872 CHEMBL1830346::US9006187, 13
SMILES CCOCCOc1ccc(Cc2cc(sc2Cl)[C@@H]2O[C@H](CO)[C@@H](O)[C@H](O)[C@H]2O)cc1
InChI Key InChIKey=MRRKXTDCILBVIR-PKOFMYQESA-N
Data  2 IC50
  Tab Delimited (TSV)   2D SDfile   Computed 3D by Vconf -m prep SDfile
Find this compound or compounds like it in BindingDB:
Activity Spreadsheet -- Enzyme Inhibition Constant Data from BindingDB
Found 2 hits for monomerid = 50353872
TargetSodium/glucose cotransporter 2(Homo sapiens (Human))
Green Cross
Curated by ChEMBL
LigandPNGBDBM50353872(CHEMBL1830346 | US9006187, 13)
Affinity DataIC50:  70.7nM. Assay description: Inhibition of human SGLT2 expressed in CHO cells assessed as [14C]-alpha-methyl-D-glucopyranoside uptake after 2 hrs by liquid scintillation counting
In DepthDetails ArticlePubMed
TargetSodium/glucose cotransporter 2(Homo sapiens (Human))
Green Cross
Curated by ChEMBL
LigandPNGBDBM50353872(CHEMBL1830346 | US9006187, 13)
Affinity DataIC50:  70.7nMpH: 7.4 T: 2°C. Assay description: For sodium-dependent glucose transport assay, cells expressing hSGLT2 were seeded into a 96-well culture plate at a density of 5x104 cells/well in RP...
In DepthDetails US Patent