BDBM50354968 CHEMBL1836933
SMILES COc1ccc(c(C)c1)-n1c(C)nc2c(NC(C3CC3)C3CC3)nc(C)nc12
InChI Key InChIKey=UZPJXDUEOHPKCO-UHFFFAOYSA-N
Data  1 KI
  Tab Delimited (TSV)   2D SDfile   Computed 3D by Vconf -m prep SDfile
Find this compound or compounds like it in BindingDB:
Activity Spreadsheet -- Enzyme Inhibition Constant Data from BindingDB
Found 1 hit for monomerid = 50354968
TargetCorticotropin-releasing factor receptor 1(Homo sapiens (Human))
Pfizer
Curated by ChEMBL
LigandPNGBDBM50354968(CHEMBL1836933)
Affinity DataKi:  14nM. Assay description: Antagonist activity at recombinant human CRF1 receptor expressed in CHO cells assessed as inhibition of CRF-induced cAMP formation
In DepthDetails ArticlePubMed