BDBM50355132 CHEMBL1835776
SMILES CCN(CC)CCCOc1ccc(cc1)-c1nn(C(C)C)c(=O)c2ccsc12
InChI Key InChIKey=FOFOCYNVIJYQJC-UHFFFAOYSA-N
Data  2 KI
  Tab Delimited (TSV)   2D SDfile   Computed 3D by Vconf -m prep SDfile
Find this compound or compounds like it in BindingDB:
Activity Spreadsheet -- Enzyme Inhibition Constant Data from BindingDB
Found 2 hits for monomerid = 50355132
TargetHistamine H3 receptor(Homo sapiens (Human))
Cephalon
Curated by ChEMBL
LigandPNGBDBM50355132(CHEMBL1835776)
Affinity DataKi:  23nM. Assay description: Displacement of [3H]-NAMH from human histamine H3 receptor expressed in CHO cells
In DepthDetails ArticlePubMed
TargetHistamine H3 receptor(Rattus norvegicus (rat))
Cephalon
Curated by ChEMBL
LigandPNGBDBM50355132(CHEMBL1835776)
Affinity DataKi:  167nM. Assay description: Displacement of [3H]-NAMH from rat histamine H3 receptor expressed in CHO cells
In DepthDetails ArticlePubMed