BDBM50355134 CHEMBL1835774
SMILES COC[C@@H]1CCCN1CCCOc1ccc(cc1)-c1nn(C(C)C)c(=O)c2ccsc12
InChI Key InChIKey=VHOMOVHJTOKEFG-IBGZPJMESA-N
Data  2 KI
  Tab Delimited (TSV)   2D SDfile   Computed 3D by Vconf -m prep SDfile
Find this compound or compounds like it in BindingDB:
Activity Spreadsheet -- Enzyme Inhibition Constant Data from BindingDB
Found 2 hits for monomerid = 50355134
TargetHistamine H3 receptor(Homo sapiens (Human))
Cephalon
Curated by ChEMBL
LigandPNGBDBM50355134(CHEMBL1835774)
Affinity DataKi:  50nM. Assay description: Displacement of [3H]-NAMH from human histamine H3 receptor expressed in CHO cells
In DepthDetails ArticlePubMed
TargetHistamine H3 receptor(Rattus norvegicus (rat))
Cephalon
Curated by ChEMBL
LigandPNGBDBM50355134(CHEMBL1835774)
Affinity DataKi:  1.17E+3nM. Assay description: Displacement of [3H]-NAMH from rat histamine H3 receptor expressed in CHO cells
In DepthDetails ArticlePubMed