BDBM50355151 CHEMBL1834629
SMILES Cn1cc2c(n1)nc(NC(=O)Nc1ccc(F)cc1)n1nc(nc21)-c1ccc(cc1)-c1ccccc1
InChI Key InChIKey=NIHMMOSZQQBTLY-UHFFFAOYSA-N
Data  4 KI
  Tab Delimited (TSV)   2D SDfile   Computed 3D by Vconf -m prep SDfile
Find this compound or compounds like it in BindingDB:
Activity Spreadsheet -- Enzyme Inhibition Constant Data from BindingDB
Found 4 hits for monomerid = 50355151
TargetAdenosine receptor A3(Homo sapiens (Human))
National University Of Singapore
Curated by ChEMBL
LigandPNGBDBM50355151(CHEMBL1834629)
Affinity DataKi:  4.06nM. Assay description: Displacement of [3H]NECA from human recombinant adenosine A3 receptor expressed in CHO cells after 3 hrs
In DepthDetails ArticlePubMed
TargetAdenosine receptor A2b(Homo sapiens (Human))
National University Of Singapore
Curated by ChEMBL
LigandPNGBDBM50355151(CHEMBL1834629)
Affinity DataKi: >1.00E+4nM. Assay description: Antagonist activity human recombinant adenosine 2B receptor expressed in CHO cells assessed as inhibition of NECA-stimulated adenylyl cyclase activit...
In DepthDetails ArticlePubMed
TargetAdenosine receptor A2a(Homo sapiens (Human))
National University Of Singapore
Curated by ChEMBL
LigandPNGBDBM50355151(CHEMBL1834629)
Affinity DataKi: >1.00E+5nM. Assay description: Displacement of [3H]NECA from human recombinant adenosine 2A receptor expressed in CHO cells after 3 hrs
In DepthDetails ArticlePubMed
TargetAdenosine receptor A1(Homo sapiens (Human))
National University Of Singapore
Curated by ChEMBL
LigandPNGBDBM50355151(CHEMBL1834629)
Affinity DataKi: >1.00E+5nM. Assay description: Displacement of [3H]CCPA from human recombinant adenosine A1 receptor expressed in CHO cells after 3 hrs
In DepthDetails ArticlePubMed