BDBM503555 (S,Z)-N-(4-fluorobicyclo[4.2.0]octa- 1(6),2,4-trien-7-yl)-N'-hydroxy-4- ((1-sulfamoylazetidin-3-yl)oxy)- 1,2,5-oxadiazole-3-carboximidamide::US11034661, Example 62
SMILES NS(=O)(=O)N1CC(C1)Oc1nonc1\C(N[C@H]1Cc2ccc(F)cc12)=N\O
InChI Key InChIKey=KGRSWWGNPBJHIR-NSHDSACASA-N
Data  1 IC50
  Tab Delimited (TSV)   2D SDfile   Computed 3D by Vconf -m prep SDfile
Find this compound or compounds like it in BindingDB:
Activity Spreadsheet -- Enzyme Inhibition Constant Data from BindingDB
Found 1 hit for monomerid = 503555
TargetIndoleamine 2,3-dioxygenase 1(Homo sapiens (Human))
Merck Sharp & Dohme
US Patent
LigandPNGBDBM503555((S,Z)-N-(4-fluorobicyclo[4.2.0]octa- 1(6),2,4-tri...)
Affinity DataIC50:  24nM. Assay description: HIS-tagged IDO1 protein was recombinantly expressed in Escherichia coli using ZYP5052 autoinduction media supplemented with 500 μM delta aminole...
Ligand InfoPC cidPC sid
In DepthDetails US Patent