BDBM50356131 CHEMBL1909791
SMILES NC(=N)NC(=O)c1nc(Cl)c(NCC#N)nc1N
InChI Key InChIKey=JGRVDBVRGSMYFS-UHFFFAOYSA-N
Data  1 IC50
  Tab Delimited (TSV)   2D SDfile   Computed 3D by Vconf -m prep SDfile
Find this compound or compounds like it in BindingDB:
Activity Spreadsheet -- Enzyme Inhibition Constant Data from BindingDB
Found 1 hit for monomerid = 50356131
TargetUrokinase-type plasminogen activator(Homo sapiens (Human))
University Of Wollongong
Curated by ChEMBL
LigandPNGBDBM50356131(CHEMBL1909791)
Affinity DataIC50:  5.00E+4nM. Assay description: Inhibition of urokinase-type plasminogen activator
In DepthDetails ArticlePubMed