BDBM503574 US11034670, Ex. 14
SMILES Cc1ccc2nc(CCC(=O)N3CCN(CC3)c3ccc(cn3)C#N)[nH]c(=O)c2c1
InChI Key InChIKey=QKAXQQFCSGLNEI-UHFFFAOYSA-N
Data  1 IC50
  Tab Delimited (TSV)   2D SDfile   Computed 3D by Vconf -m prep SDfile
Find this compound or compounds like it in BindingDB:
Activity Spreadsheet -- Enzyme Inhibition Constant Data from BindingDB
Found 1 hit for monomerid = 503574
TargetPoly [ADP-ribose] polymerase 1(Homo sapiens (Human))
Mitobridge
US Patent
LigandPNGBDBM503574(US11034670, Ex. 14)
Affinity DataIC50:  23nM. Assay description: The scintillation proximity assay (SPA) is designed to measure PARP activity using purified recombinant PARP-1 enzyme and is ideal for high throughpu...
Ligand InfoPC cidPC sid
In DepthDetails US Patent