BDBM503576 US11034670, Ex. 16
SMILES Cc1cccc2c1nc(CCC(=O)N1CCN(CC1)c1ccc(cn1)C#N)[nH]c2=O
InChI Key InChIKey=BSHNSNFEEYZSMQ-UHFFFAOYSA-N
Data  2 IC50
  Tab Delimited (TSV)   2D SDfile   Computed 3D by Vconf -m prep SDfile
Find this compound or compounds like it in BindingDB:
Activity Spreadsheet -- Enzyme Inhibition Constant Data from BindingDB
Found 2 hits for monomerid = 503576
TargetPoly [ADP-ribose] polymerase 2(Homo sapiens (Human))
Mitobridge
US Patent
LigandPNGBDBM503576(US11034670, Ex. 16)
Affinity DataIC50:  40nM. Assay description: The scintillation proximity assay (SPA) is designed to measure PARP activity using purified recombinant PARP-1 enzyme and is ideal for high throughpu...
Ligand InfoPC cidPC sid
In DepthDetails US Patent
TargetPoly [ADP-ribose] polymerase 1(Homo sapiens (Human))
Mitobridge
US Patent
LigandPNGBDBM503576(US11034670, Ex. 16)
Affinity DataIC50:  7nM. Assay description: The scintillation proximity assay (SPA) is designed to measure PARP activity using purified recombinant PARP-1 enzyme and is ideal for high throughpu...
Ligand InfoPC cidPC sid
In DepthDetails US Patent