BDBM50357743 CHEMBL1916002
SMILES CCCC[C@H]1CCN([C@@H](CCc2ccccc2)C(=O)N[C@@H](Cc2cc(F)cc(F)c2)[C@H](O)[C@H]2C[C@@H](O)CN2)C1=O
InChI Key InChIKey=JZIFFYJEFQCCJY-NTVBGXBNSA-N
Data  2 IC50
  Tab Delimited (TSV)   2D SDfile   Computed 3D by Vconf -m prep SDfile
Find this compound or compounds like it in BindingDB:
Activity Spreadsheet -- Enzyme Inhibition Constant Data from BindingDB
Found 2 hits for monomerid = 50357743
TargetBeta-secretase 1(Homo sapiens (Human))
Bristol-Myers Squibb
Curated by ChEMBL
LigandPNGBDBM50357743(CHEMBL1916002)
Affinity DataIC50:  650nM. Assay description: Inhibition of BACE1 in human HEK293 cells expressing swedish mutant APP
In DepthDetails ArticlePubMed
TargetBeta-secretase 1(Homo sapiens (Human))
Bristol-Myers Squibb
Curated by ChEMBL
LigandPNGBDBM50357743(CHEMBL1916002)
Affinity DataIC50:  25nM. Assay description: Inhibition of BACE1 by HPLC method
In DepthDetails ArticlePubMed