BDBM50358190 CHEMBL1921968
SMILES Cc1nc(sc1C)N1C(C(C(=O)c2cccs2)C(=O)C1=O)c1ccccc1
InChI Key InChIKey=DEFOYXODOLNBEH-UHFFFAOYSA-N
Data  1 IC50
  Tab Delimited (TSV)   2D SDfile   Computed 3D by Vconf -m prep SDfile
Find this compound or compounds like it in BindingDB:
Activity Spreadsheet -- Enzyme Inhibition Constant Data from BindingDB
Found 1 hit for monomerid = 50358190
TargetSuppressor of tumorigenicity 14 protein(Homo sapiens (Human))
University Of Maryland
Curated by ChEMBL
LigandPNGBDBM50358190(CHEMBL1921968)
Affinity DataIC50:  7.00E+3nM. Assay description: Inhibition of acid-induced matriptase activation in human 184A1N4 cells using mAb M69 by cell-based ELISA like assay
In DepthDetails ArticlePubMed