BDBM50358280 CHEMBL1922396
SMILES Oc1cc(O)c(cc1Br)C(c1cccc(c1)[N+]([O-])=O)c1cc(Br)c(O)cc1O
InChI Key InChIKey=GVPFJFOFGFDIBN-UHFFFAOYSA-N
Data  1 IC50
  Tab Delimited (TSV)   2D SDfile   Computed 3D by Vconf -m prep SDfile
Find this compound or compounds like it in BindingDB:
Activity Spreadsheet -- Enzyme Inhibition Constant Data from BindingDB
Found 1 hit for monomerid = 50358280
TargetIsocitrate lyase(Candida albicans)
University Of East Anglia
Curated by ChEMBL
LigandPNGBDBM50358280(CHEMBL1922396)
Affinity DataIC50:  2.68E+4nM. Assay description: Inhibition of Candida albicans isocitrate lyase after 30 mins
In DepthDetails ArticlePubMed