BDBM50361127 CHEMBL1933603
SMILES Cc1[nH]n(-c2ccccn2)c(=O)c1C(=O)Nc1ccccc1
InChI Key InChIKey=QJEBTCLOCMTSJU-UHFFFAOYSA-N
Data  2 IC50
  Tab Delimited (TSV)   2D SDfile   Computed 3D by Vconf -m prep SDfile
Find this compound or compounds like it in BindingDB:
Activity Spreadsheet -- Enzyme Inhibition Constant Data from BindingDB
Found 2 hits for monomerid = 50361127
TargetAlpha-ketoglutarate-dependent dioxygenase alkB homolog 3(Homo sapiens (Human))
Hyogo University Of Health Science
Curated by ChEMBL
LigandPNGBDBM50361127(CHEMBL1933603)
Affinity DataIC50:  1.70E+3nM. Assay description: Inhibition of demethylase activity of PCA-1 (unknown origin) using 3-methyl cytosine oligo DNA as substrate after 1 hr by RT-PCR analysis
In DepthDetails ArticlePubMed
TargetNatural resistance-associated macrophage protein 2(Homo sapiens (Human))
Xenon Pharmaceuticals
Curated by ChEMBL
LigandPNGBDBM50361127(CHEMBL1933603)
Affinity DataIC50:  640nM. Assay description: Inhibition of human DMT1 expressed in CHO cells assessed as blockage of ferrous influx after 20 mins by calcein fluorescence quenching method
In DepthDetails ArticlePubMed