BDBM50361320 CHEMBL1935747
SMILES COc1ccc(NC(=O)Nc2nc3cn(C)cc3c3nc(nn23)-c2ccco2)cc1
InChI Key InChIKey=JCTPGWIOTVQRJJ-UHFFFAOYSA-N
Data  3 KI  2 IC50
  Tab Delimited (TSV)   2D SDfile   Computed 3D by Vconf -m prep SDfile
Find this compound or compounds like it in BindingDB:
Activity Spreadsheet -- Enzyme Inhibition Constant Data from BindingDB
Found 5 hits for monomerid = 50361320
TargetAdenosine receptor A3(Homo sapiens (Human))
Universit£
Curated by ChEMBL
LigandPNGBDBM50361320(CHEMBL1935747)
Affinity DataKi:  15nM. Assay description: Displacement of [3H]-MRE-3008-F20 from human adenosine A3 receptor expressed in CHO cells after 120 mins by liquid scintillation counting
In DepthDetails ArticlePubMed
TargetAdenosine receptor A2a(Homo sapiens (Human))
Universit£
Curated by ChEMBL
LigandPNGBDBM50361320(CHEMBL1935747)
Affinity DataKi:  500nM. Assay description: Displacement of [3H]-ZM 241385 from human adenosine A2A receptor expressed in CHO cells after 60 mins by liquid scintillation counting
In DepthDetails ArticlePubMed
TargetAdenosine receptor A1(Homo sapiens (Human))
Universit£
Curated by ChEMBL
LigandPNGBDBM50361320(CHEMBL1935747)
Affinity DataKi:  800nM. Assay description: Displacement of [3H]-DPCPX from human adenosine A1 receptor expressed in CHO cells after 120 mins by liquid scintillation counting
In DepthDetails ArticlePubMed
TargetAdenosine receptor A3(Homo sapiens (Human))
Universit£
Curated by ChEMBL
LigandPNGBDBM50361320(CHEMBL1935747)
Affinity DataIC50:  75nM. Assay description: Antagonist activity at human adenosine A3 receptor expressed in forskolin-stimulated CHO cells assessed as inhibition of Cl-IB-MECA-induced cAMP prod...
In DepthDetails ArticlePubMed
TargetAdenosine receptor A2b(Homo sapiens (Human))
Universit£
Curated by ChEMBL
LigandPNGBDBM50361320(CHEMBL1935747)
Affinity DataIC50:  838nM. Assay description: Antagonist activity at human adenosine A2B receptor expressed in CHO cells assessed as inhibition of NECA-induced cAMP production by competition prot...
In DepthDetails ArticlePubMed