BDBM50362581 CHEMBL1938868
SMILES COc1cc(N)nc(SCc2ccc(cc2)C(C)(C)C)n1
InChI Key InChIKey=DHVHTRPJHHDARQ-UHFFFAOYSA-N
Data  1 IC50
  Tab Delimited (TSV)   2D SDfile   Computed 3D by Vconf -m prep SDfile
Find this compound or compounds like it in BindingDB:
Activity Spreadsheet -- Enzyme Inhibition Constant Data from BindingDB
Found 1 hit for monomerid = 50362581
TargetSodium channel protein type 9 subunit alpha(Homo sapiens (Human))
Amgen
Curated by ChEMBL
LigandPNGBDBM50362581(CHEMBL1938868)
Affinity DataIC50: >3.00E+4nM. Assay description: Antagonist activity at 20% inactivated human sodium channel Nav1.7 expressed in human HEK293 cells by patch-clamp electrophysiological assay
In DepthDetails ArticlePubMed