BDBM50363174 CHEMBL1946297
SMILES CCCCC#Cc1nc(NCc2cccc(I)c2)c2ncn([C@@H]3SC[C@@H](O)[C@H]3O)c2n1
InChI Key InChIKey=BWQVTJDSJWOULX-ZWDAVXSWSA-N
Data  2 KI
  Tab Delimited (TSV)   2D SDfile   Computed 3D by Vconf -m prep SDfile
Find this compound or compounds like it in BindingDB:
Activity Spreadsheet -- Enzyme Inhibition Constant Data from BindingDB
Found 2 hits for monomerid = 50363174
TargetAdenosine receptor A3(Homo sapiens (Human))
Ewha Womans University
Curated by ChEMBL
LigandPNGBDBM50363174(CHEMBL1946297)
Affinity DataKi:  39nM. Assay description: Displacement of [125I]I-AB-MECA from human adenosine A3 receptor expressed in CHO cells after 60 mins by gamma counting
In DepthDetails ArticlePubMed
TargetAdenosine receptor A2a(Homo sapiens (Human))
Ewha Womans University
Curated by ChEMBL
LigandPNGBDBM50363174(CHEMBL1946297)
Affinity DataKi:  4.89E+3nM. Assay description: Displacement of [3H]CGS21680 from human adenosine A2A receptor expressed in HEK293 cells after 60 mins by gamma counting
In DepthDetails ArticlePubMed